Art Des Topfträgers (Eclass-6.1)
type: DatatypeProperty
domain: ProductOrService
range: string
comment: Merkmal "Art Des Topfträgers" Aus Der Klassifikation "Eclass-6.1".
sub property of: datatypeProductOrServiceProperty

Abdeckungsart (Eclass-6.1)
type: DatatypeProperty
domain: ProductOrService
range: string
comment: Merkmal "Abdeckungsart" Aus Der Klassifikation "Eclass-6.1".
sub property of: datatypeProductOrServiceProperty

Ablasshahn (Eclass-6.1)
type: DatatypeProperty
domain: ProductOrService
range: string
comment: Merkmal "Ablasshahn" Aus Der Klassifikation "Eclass-6.1".
sub property of: datatypeProductOrServiceProperty

Abluftschlauch (Eclass-6.1)
type: DatatypeProperty
domain: ProductOrService
range: string
comment: Merkmal "Abluftschlauch" Aus Der Klassifikation "Eclass-6.1".
sub property of: datatypeProductOrServiceProperty

Abmessung Der 1. Kochzone (Eclass-6.1)
type: ObjectProperty
domain: ProductOrService
range: QuantitativeValueFloat
comment: Merkmal "Abmessung Der 1. Kochzone" Aus Der Klassifikation "Eclass-6.1".
sub property of: quantitativeProductOrServiceProperty

Abmessung Der 2. Kochzone (Eclass-6.1)
type: ObjectProperty
domain: ProductOrService
range: QuantitativeValueFloat
comment: Merkmal "Abmessung Der 2. Kochzone" Aus Der Klassifikation "Eclass-6.1".
sub property of: quantitativeProductOrServiceProperty

Abmessung Der 3. Kochzone (Eclass-6.1)
type: ObjectProperty
domain: ProductOrService
range: QuantitativeValueFloat
comment: Merkmal "Abmessung Der 3. Kochzone" Aus Der Klassifikation "Eclass-6.1".
sub property of: quantitativeProductOrServiceProperty

Abmessung Der 4. Kochzone (Eclass-6.1)
type: ObjectProperty
domain: ProductOrService
range: QuantitativeValueFloat
comment: Merkmal "Abmessung Der 4. Kochzone" Aus Der Klassifikation "Eclass-6.1".
sub property of: quantitativeProductOrServiceProperty

Abmessung Der 5. Kochzone (Eclass-6.1)
type: ObjectProperty
domain: ProductOrService
range: QuantitativeValueFloat
comment: Merkmal "Abmessung Der 5. Kochzone" Aus Der Klassifikation "Eclass-6.1".
sub property of: quantitativeProductOrServiceProperty

Abmessungen Der Palette (Eclass-6.1)
type: ObjectProperty
domain: ProductOrService
range: QuantitativeValueFloat
comment: Merkmal "Abmessungen Der Palette" Aus Der Klassifikation "Eclass-6.1".
sub property of: quantitativeProductOrServiceProperty

Abmessungen Des Gerätes (Eclass-6.1)
type: ObjectProperty
domain: ProductOrService
range: QuantitativeValueFloat
comment: Merkmal "Abmessungen Des Gerätes" Aus Der Klassifikation "Eclass-6.1".
sub property of: quantitativeProductOrServiceProperty

Abschaltbar Drehteller (Eclass-6.1)
type: DatatypeProperty
domain: ProductOrService
range: string
comment: Merkmal "Abschaltbar Drehteller" Aus Der Klassifikation "Eclass-6.1".
sub property of: datatypeProductOrServiceProperty

Abschließbare Tür (Eclass-6.1)
type: DatatypeProperty
domain: ProductOrService
range: string
comment: Merkmal "Abschließbare Tür" Aus Der Klassifikation "Eclass-6.1".
sub property of: datatypeProductOrServiceProperty

Absicherung (Eclass-6.1)
type: ObjectProperty
domain: ProductOrService
range: QuantitativeValueFloat
comment: Merkmal "Absicherung" Aus Der Klassifikation "Eclass-6.1".
sub property of: quantitativeProductOrServiceProperty

Abtauvorgang (Gefrierteil) (Eclass-6.1)
type: DatatypeProperty
domain: ProductOrService
range: string
comment: Merkmal "Abtauvorgang (Gefrierteil)" Aus Der Klassifikation "Eclass-6.1".
sub property of: datatypeProductOrServiceProperty

Abtauvorgang (Kühlteil) (Eclass-6.1)
type: DatatypeProperty
domain: ProductOrService
range: string
comment: Merkmal "Abtauvorgang (Kühlteil)" Aus Der Klassifikation "Eclass-6.1".
sub property of: datatypeProductOrServiceProperty

Aktualisierungsfunktion (Eclass-6.1)
type: DatatypeProperty
domain: ProductOrService
range: string
comment: Merkmal "Aktualisierungsfunktion" Aus Der Klassifikation "Eclass-6.1".
sub property of: datatypeProductOrServiceProperty

Alternative Gasart (Eclass-6.1)
type: DatatypeProperty
domain: ProductOrService
range: string
comment: Merkmal "Alternative Gasart" Aus Der Klassifikation "Eclass-6.1".
sub property of: datatypeProductOrServiceProperty

Anschlusswert Elektrische Leistung (Eclass-6.1)
type: ObjectProperty
type: DatatypeProperty
domain: ProductOrService
range: QuantitativeValueFloat
range: string
comment: Merkmal "Anschlusswert Elektrische Leistung" Aus Der Klassifikation "Eclass-6.1".
sub property of: quantitativeProductOrServiceProperty
sub property of: datatypeProductOrServiceProperty

Anzahl Auszüge/Körbe (Eclass-6.1)
type: DatatypeProperty
domain: ProductOrService
range: string
comment: Merkmal "Anzahl Auszüge/Körbe" Aus Der Klassifikation "Eclass-6.1".
sub property of: datatypeProductOrServiceProperty

Anzahl Automatikprogramme (Eclass-6.1)
type: DatatypeProperty
domain: ProductOrService
range: string
comment: Merkmal "Anzahl Automatikprogramme" Aus Der Klassifikation "Eclass-6.1".
sub property of: datatypeProductOrServiceProperty

Anzahl Eier (Eclass-6.1)
type: ObjectProperty
domain: ProductOrService
range: QuantitativeValueFloat
comment: Merkmal "Anzahl Eier" Aus Der Klassifikation "Eclass-6.1".
sub property of: quantitativeProductOrServiceProperty

Anzahl Elektrokochzonen (Eclass-6.1)
type: DatatypeProperty
domain: ProductOrService
range: string
comment: Merkmal "Anzahl Elektrokochzonen" Aus Der Klassifikation "Eclass-6.1".
sub property of: datatypeProductOrServiceProperty

Anzahl Flaschen Zur Lagerung (Eclass-6.1)
type: DatatypeProperty
domain: ProductOrService
range: string
comment: Merkmal "Anzahl Flaschen Zur Lagerung" Aus Der Klassifikation "Eclass-6.1".
sub property of: datatypeProductOrServiceProperty

Anzahl Gasbrenner (Eclass-6.1)
type: DatatypeProperty
domain: ProductOrService
range: string
comment: Merkmal "Anzahl Gasbrenner" Aus Der Klassifikation "Eclass-6.1".
sub property of: datatypeProductOrServiceProperty

Anzahl Gefrierfächer Mit Klappen (Eclass-6.1)
type: DatatypeProperty
domain: ProductOrService
range: string
comment: Merkmal "Anzahl Gefrierfächer Mit Klappen" Aus Der Klassifikation "Eclass-6.1".
sub property of: datatypeProductOrServiceProperty

Anzahl Gefrierschubladen (Eclass-6.1)
type: DatatypeProperty
domain: ProductOrService
range: string
comment: Merkmal "Anzahl Gefrierschubladen" Aus Der Klassifikation "Eclass-6.1".
sub property of: datatypeProductOrServiceProperty

Anzahl Halogenkochzonen (Eclass-6.1)
type: DatatypeProperty
domain: ProductOrService
range: string
comment: Merkmal "Anzahl Halogenkochzonen" Aus Der Klassifikation "Eclass-6.1".
sub property of: datatypeProductOrServiceProperty

Anzahl Induktionskochzonen (Eclass-6.1)
type: DatatypeProperty
domain: ProductOrService
range: string
comment: Merkmal "Anzahl Induktionskochzonen" Aus Der Klassifikation "Eclass-6.1".
sub property of: datatypeProductOrServiceProperty

Anzahl Innenbeleuchtung (Eclass-6.1)
type: DatatypeProperty
domain: ProductOrService
range: string
comment: Merkmal "Anzahl Innenbeleuchtung" Aus Der Klassifikation "Eclass-6.1".
sub property of: datatypeProductOrServiceProperty

Anzahl Lampen (Eclass-6.1)
type: DatatypeProperty
domain: ProductOrService
range: string
comment: Merkmal "Anzahl Lampen" Aus Der Klassifikation "Eclass-6.1".
sub property of: datatypeProductOrServiceProperty

Anzahl Leistungsstufen (Eclass-6.1)
type: DatatypeProperty
domain: ProductOrService
range: string
comment: Merkmal "Anzahl Leistungsstufen" Aus Der Klassifikation "Eclass-6.1".
sub property of: datatypeProductOrServiceProperty

Anzahl Maßgedecke (Eclass-6.1)
type: DatatypeProperty
domain: ProductOrService
range: string
comment: Merkmal "Anzahl Maßgedecke" Aus Der Klassifikation "Eclass-6.1".
sub property of: datatypeProductOrServiceProperty

Anzahl Programme (Eclass-6.1)
type: DatatypeProperty
domain: ProductOrService
range: string
comment: Merkmal "Anzahl Programme" Aus Der Klassifikation "Eclass-6.1".
sub property of: datatypeProductOrServiceProperty

Anzahl Temperaturzonen (Eclass-6.1)
type: DatatypeProperty
domain: ProductOrService
range: string
comment: Merkmal "Anzahl Temperaturzonen" Aus Der Klassifikation "Eclass-6.1".
sub property of: datatypeProductOrServiceProperty

Anzahl Verdichter (Eclass-6.1)
type: DatatypeProperty
domain: ProductOrService
range: string
comment: Merkmal "Anzahl Verdichter" Aus Der Klassifikation "Eclass-6.1".
sub property of: datatypeProductOrServiceProperty

Anzahl Der Ablagen (Eclass-6.1)
type: DatatypeProperty
domain: ProductOrService
range: string
comment: Merkmal "Anzahl Der Ablagen" Aus Der Klassifikation "Eclass-6.1".
sub property of: datatypeProductOrServiceProperty

Anzahl Der Ablagen Im Kühlteil (Eclass-6.1)
type: DatatypeProperty
domain: ProductOrService
range: string
comment: Merkmal "Anzahl Der Ablagen Im Kühlteil" Aus Der Klassifikation "Eclass-6.1".
sub property of: datatypeProductOrServiceProperty

Anzahl Der Kochstufen (Eclass-6.1)
type: DatatypeProperty
domain: ProductOrService
range: string
comment: Merkmal "Anzahl Der Kochstufen" Aus Der Klassifikation "Eclass-6.1".
sub property of: datatypeProductOrServiceProperty

Anzahl Der Kochzonen, Die Gleichzeitig Benutzt Werden Können (Eclass-6.1)
type: DatatypeProperty
domain: ProductOrService
range: string
comment: Merkmal "Anzahl Der Kochzonen, Die Gleichzeitig Benutzt Werden Können" Aus Der Klassifikation "Eclass-6.1".
sub property of: datatypeProductOrServiceProperty

Anzahl Der Kochzonen Mit Strahlungsheizung (Eclass-6.1)
type: DatatypeProperty
domain: ProductOrService
range: string
comment: Merkmal "Anzahl Der Kochzonen Mit Strahlungsheizung" Aus Der Klassifikation "Eclass-6.1".
sub property of: datatypeProductOrServiceProperty

Anzahl Der Verstellbaren Ablagen Im Kühlteil (Eclass-6.1)
type: DatatypeProperty
domain: ProductOrService
range: string
comment: Merkmal "Anzahl Der Verstellbaren Ablagen Im Kühlteil" Aus Der Klassifikation "Eclass-6.1".
sub property of: datatypeProductOrServiceProperty

Anzahl Elektrische Kochplatten (Eclass-6.1)
type: DatatypeProperty
domain: ProductOrService
range: string
comment: Merkmal "Anzahl Elektrische Kochplatten" Aus Der Klassifikation "Eclass-6.1".
sub property of: datatypeProductOrServiceProperty

Anzahl Elektrische Warmhaltezonen (Eclass-6.1)
type: DatatypeProperty
domain: ProductOrService
range: string
comment: Merkmal "Anzahl Elektrische Warmhaltezonen" Aus Der Klassifikation "Eclass-6.1".
sub property of: datatypeProductOrServiceProperty

Anzahl Unabhängiger Kühlkreisläufe (Eclass-6.1)
type: DatatypeProperty
domain: ProductOrService
range: string
comment: Merkmal "Anzahl Unabhängiger Kühlkreisläufe" Aus Der Klassifikation "Eclass-6.1".
sub property of: datatypeProductOrServiceProperty

Anzahl Verschiedener Spültemperaturen (Eclass-6.1)
type: DatatypeProperty
domain: ProductOrService
range: string
comment: Merkmal "Anzahl Verschiedener Spültemperaturen" Aus Der Klassifikation "Eclass-6.1".
sub property of: datatypeProductOrServiceProperty

Anzahl Verstellbarer Ablagen (Eclass-6.1)
type: DatatypeProperty
domain: ProductOrService
range: string
comment: Merkmal "Anzahl Verstellbarer Ablagen" Aus Der Klassifikation "Eclass-6.1".
sub property of: datatypeProductOrServiceProperty

Anzeige Programmende Vorhanden (Eclass-6.1)
type: DatatypeProperty
domain: ProductOrService
range: string
comment: Merkmal "Anzeige Programmende Vorhanden" Aus Der Klassifikation "Eclass-6.1".
sub property of: datatypeProductOrServiceProperty

Anzeige Für Reinigung Flusenfilter (Eclass-6.1)
type: DatatypeProperty
domain: ProductOrService
range: string
comment: Merkmal "Anzeige Für Reinigung Flusenfilter" Aus Der Klassifikation "Eclass-6.1".
sub property of: datatypeProductOrServiceProperty

Approbationszertifikate (Eclass-6.1)
type: DatatypeProperty
domain: ProductOrService
range: string
comment: Merkmal "Approbationszertifikate" Aus Der Klassifikation "Eclass-6.1".
sub property of: datatypeProductOrServiceProperty

Arbeitsplatte Abnehmbar (Eclass-6.1)
type: DatatypeProperty
domain: ProductOrService
range: string
comment: Merkmal "Arbeitsplatte Abnehmbar" Aus Der Klassifikation "Eclass-6.1".
sub property of: datatypeProductOrServiceProperty

Art Gasanschluss (Eclass-6.1)
type: DatatypeProperty
domain: ProductOrService
range: string
comment: Merkmal "Art Gasanschluss" Aus Der Klassifikation "Eclass-6.1".
sub property of: datatypeProductOrServiceProperty

Art Der 1. Kochzone (Eclass-6.1)
type: DatatypeProperty
domain: ProductOrService
range: string
comment: Merkmal "Art Der 1. Kochzone" Aus Der Klassifikation "Eclass-6.1".
sub property of: datatypeProductOrServiceProperty

Art Der 2. Kochzone (Eclass-6.1)
type: DatatypeProperty
domain: ProductOrService
range: string
comment: Merkmal "Art Der 2. Kochzone" Aus Der Klassifikation "Eclass-6.1".
sub property of: datatypeProductOrServiceProperty

Art Der 3. Kochzone (Eclass-6.1)
type: DatatypeProperty
domain: ProductOrService
range: string
comment: Merkmal "Art Der 3. Kochzone" Aus Der Klassifikation "Eclass-6.1".
sub property of: datatypeProductOrServiceProperty

Art Der 4. Kochzone (Eclass-6.1)
type: DatatypeProperty
domain: ProductOrService
range: string
comment: Merkmal "Art Der 4. Kochzone" Aus Der Klassifikation "Eclass-6.1".
sub property of: datatypeProductOrServiceProperty

Art Der 5. Kochzone (Eclass-6.1)
type: DatatypeProperty
domain: ProductOrService
range: string
comment: Merkmal "Art Der 5. Kochzone" Aus Der Klassifikation "Eclass-6.1".
sub property of: datatypeProductOrServiceProperty

Art Der 6. Kochzone (Eclass-6.1)
type: DatatypeProperty
domain: ProductOrService
range: string
comment: Merkmal "Art Der 6. Kochzone" Aus Der Klassifikation "Eclass-6.1".
sub property of: datatypeProductOrServiceProperty

Art Der Gassicherheitsvorrichtung (Eclass-6.1)
type: DatatypeProperty
domain: ProductOrService
range: string
comment: Merkmal "Art Der Gassicherheitsvorrichtung" Aus Der Klassifikation "Eclass-6.1".
sub property of: datatypeProductOrServiceProperty

Art Der Kochzone (Eclass-6.1)
type: DatatypeProperty
domain: ProductOrService
range: string
comment: Merkmal "Art Der Kochzone" Aus Der Klassifikation "Eclass-6.1".
sub property of: datatypeProductOrServiceProperty

Art Der Lampen (Eclass-6.1)
type: DatatypeProperty
domain: ProductOrService
range: string
comment: Merkmal "Art Der Lampen" Aus Der Klassifikation "Eclass-6.1".
sub property of: datatypeProductOrServiceProperty

Art Der Luftführung (Eclass-6.1)
type: DatatypeProperty
domain: ProductOrService
range: string
comment: Merkmal "Art Der Luftführung" Aus Der Klassifikation "Eclass-6.1".
sub property of: datatypeProductOrServiceProperty

Art Der Steuerung (Eclass-6.1)
type: DatatypeProperty
domain: ProductOrService
range: string
comment: Merkmal "Art Der Steuerung" Aus Der Klassifikation "Eclass-6.1".
sub property of: datatypeProductOrServiceProperty

Art Der Temperaturregelung (Eclass-6.1)
type: DatatypeProperty
domain: ProductOrService
range: string
comment: Merkmal "Art Der Temperaturregelung" Aus Der Klassifikation "Eclass-6.1".
sub property of: datatypeProductOrServiceProperty

Art Der Tür (Eclass-6.1)
type: DatatypeProperty
domain: ProductOrService
range: string
comment: Merkmal "Art Der Tür" Aus Der Klassifikation "Eclass-6.1".
sub property of: datatypeProductOrServiceProperty

Art Des Abtauvorganges (Eclass-6.1)
type: DatatypeProperty
domain: ProductOrService
range: string
comment: Merkmal "Art Des Abtauvorganges" Aus Der Klassifikation "Eclass-6.1".
sub property of: datatypeProductOrServiceProperty

Art Des Backblecheinschubs (Eclass-6.1)
type: DatatypeProperty
domain: ProductOrService
range: string
comment: Merkmal "Art Des Backblecheinschubs" Aus Der Klassifikation "Eclass-6.1".
sub property of: datatypeProductOrServiceProperty

Art Des Fettfilters (Eclass-6.1)
type: DatatypeProperty
domain: ProductOrService
range: string
comment: Merkmal "Art Des Fettfilters" Aus Der Klassifikation "Eclass-6.1".
sub property of: datatypeProductOrServiceProperty

Art Des Filtersystems (Eclass-6.1)
type: DatatypeProperty
domain: ProductOrService
range: string
comment: Merkmal "Art Des Filtersystems" Aus Der Klassifikation "Eclass-6.1".
sub property of: datatypeProductOrServiceProperty

Art Des Mikrowellengerätes (Eclass-6.1)
type: DatatypeProperty
domain: ProductOrService
range: string
comment: Merkmal "Art Des Mikrowellengerätes" Aus Der Klassifikation "Eclass-6.1".
sub property of: datatypeProductOrServiceProperty

Art Des Thermometers (Gefrierteil) (Eclass-6.1)
type: DatatypeProperty
domain: ProductOrService
range: string
comment: Merkmal "Art Des Thermometers (Gefrierteil)" Aus Der Klassifikation "Eclass-6.1".
sub property of: datatypeProductOrServiceProperty

Art Des Thermometers (Kühlteil) (Eclass-6.1)
type: DatatypeProperty
domain: ProductOrService
range: string
comment: Merkmal "Art Des Thermometers (Kühlteil)" Aus Der Klassifikation "Eclass-6.1".
sub property of: datatypeProductOrServiceProperty

Artikelnummer (Eclass-6.1)
type: DatatypeProperty
domain: ProductOrService
range: string
comment: Merkmal "Artikelnummer" Aus Der Klassifikation "Eclass-6.1".
sub property of: datatypeProductOrServiceProperty

Automatik-Programme (Eclass-6.1)
type: DatatypeProperty
domain: ProductOrService
range: string
comment: Merkmal "Automatik-Programme" Aus Der Klassifikation "Eclass-6.1".
sub property of: datatypeProductOrServiceProperty

Automatikprogramm (Eclass-6.1)
type: DatatypeProperty
domain: ProductOrService
range: string
comment: Merkmal "Automatikprogramm" Aus Der Klassifikation "Eclass-6.1".
sub property of: datatypeProductOrServiceProperty

Automatische Bedienelemente (Eclass-6.1)
type: DatatypeProperty
domain: ProductOrService
range: string
comment: Merkmal "Automatische Bedienelemente" Aus Der Klassifikation "Eclass-6.1".
sub property of: datatypeProductOrServiceProperty

Automatischer Eiswürfelbereiter (Eclass-6.1)
type: DatatypeProperty
domain: ProductOrService
range: string
comment: Merkmal "Automatischer Eiswürfelbereiter" Aus Der Klassifikation "Eclass-6.1".
sub property of: datatypeProductOrServiceProperty

Basisoberflächenmaterial (Eclass-6.1)
type: DatatypeProperty
domain: ProductOrService
range: string
comment: Merkmal "Basisoberflächenmaterial" Aus Der Klassifikation "Eclass-6.1".
sub property of: datatypeProductOrServiceProperty

Bauart (Eclass-6.1)
type: DatatypeProperty
domain: ProductOrService
range: string
comment: Merkmal "Bauart" Aus Der Klassifikation "Eclass-6.1".
sub property of: datatypeProductOrServiceProperty

Bauart Der Abzugshaube (Eclass-6.1)
type: DatatypeProperty
domain: ProductOrService
range: string
comment: Merkmal "Bauart Der Abzugshaube" Aus Der Klassifikation "Eclass-6.1".
sub property of: datatypeProductOrServiceProperty

Bauform (Eclass-6.1)
type: DatatypeProperty
domain: ProductOrService
range: string
comment: Merkmal "Bauform" Aus Der Klassifikation "Eclass-6.1".
sub property of: datatypeProductOrServiceProperty

Bedienelemente (Eclass-6.1)
type: DatatypeProperty
domain: ProductOrService
range: string
comment: Merkmal "Bedienelemente" Aus Der Klassifikation "Eclass-6.1".
sub property of: datatypeProductOrServiceProperty

Beheizungsart (Eclass-6.1)
type: DatatypeProperty
domain: ProductOrService
range: string
comment: Merkmal "Beheizungsart" Aus Der Klassifikation "Eclass-6.1".
sub property of: datatypeProductOrServiceProperty

Beladungsart (Eclass-6.1)
type: DatatypeProperty
domain: ProductOrService
range: string
comment: Merkmal "Beladungsart" Aus Der Klassifikation "Eclass-6.1".
sub property of: datatypeProductOrServiceProperty

Beleuchtung (Eclass-6.1)
type: DatatypeProperty
domain: ProductOrService
range: string
comment: Merkmal "Beleuchtung" Aus Der Klassifikation "Eclass-6.1".
sub property of: datatypeProductOrServiceProperty

Beleuchtungststärke Gesamt (Eclass-6.1)
type: ObjectProperty
domain: ProductOrService
range: QuantitativeValueFloat
comment: Merkmal "Beleuchtungststärke Gesamt" Aus Der Klassifikation "Eclass-6.1".
sub property of: quantitativeProductOrServiceProperty

Bereich Mögliche Verstellbarkeit Des Sockels (Eclass-6.1)
type: ObjectProperty
domain: ProductOrService
range: QuantitativeValueFloat
comment: Merkmal "Bereich Mögliche Verstellbarkeit Des Sockels" Aus Der Klassifikation "Eclass-6.1".
sub property of: quantitativeProductOrServiceProperty

Beschreibung Wassersicherheitssystem (Eclass-6.1)
type: DatatypeProperty
domain: ProductOrService
range: string
comment: Merkmal "Beschreibung Wassersicherheitssystem" Aus Der Klassifikation "Eclass-6.1".
sub property of: datatypeProductOrServiceProperty

Betriebsarten (Eclass-6.1)
type: DatatypeProperty
domain: ProductOrService
range: string
comment: Merkmal "Betriebsarten" Aus Der Klassifikation "Eclass-6.1".
sub property of: datatypeProductOrServiceProperty

Betriebskontrolleuchte (Eclass-6.1)
type: DatatypeProperty
domain: ProductOrService
range: string
comment: Merkmal "Betriebskontrolleuchte" Aus Der Klassifikation "Eclass-6.1".
sub property of: datatypeProductOrServiceProperty

Betriebskontrollleuchte (Eclass-6.1)
type: DatatypeProperty
domain: ProductOrService
range: string
comment: Merkmal "Betriebskontrollleuchte" Aus Der Klassifikation "Eclass-6.1".
sub property of: datatypeProductOrServiceProperty

Breite Garraum (Eclass-6.1)
type: ObjectProperty
domain: ProductOrService
range: QuantitativeValueFloat
comment: Merkmal "Breite Garraum" Aus Der Klassifikation "Eclass-6.1".
sub property of: quantitativeProductOrServiceProperty

Bruttofassungsvermögen (Frischhaltefach) (Eclass-6.1)
type: ObjectProperty
domain: ProductOrService
range: QuantitativeValueFloat
comment: Merkmal "Bruttofassungsvermögen (Frischhaltefach)" Aus Der Klassifikation "Eclass-6.1".
sub property of: quantitativeProductOrServiceProperty

Bruttofassungsvermögen (Gefrierzone) (Eclass-6.1)
type: ObjectProperty
domain: ProductOrService
range: QuantitativeValueFloat
comment: Merkmal "Bruttofassungsvermögen (Gefrierzone)" Aus Der Klassifikation "Eclass-6.1".
sub property of: quantitativeProductOrServiceProperty

Bruttofassungsvermögen (Metrisch) (Eclass-6.1)
type: ObjectProperty
domain: ProductOrService
range: QuantitativeValueFloat
comment: Merkmal "Bruttofassungsvermögen (Metrisch)" Aus Der Klassifikation "Eclass-6.1".
sub property of: quantitativeProductOrServiceProperty

Bruttogewicht (Eclass-6.1)
type: ObjectProperty
domain: ProductOrService
range: QuantitativeValueFloat
comment: Merkmal "Bruttogewicht" Aus Der Klassifikation "Eclass-6.1".
sub property of: quantitativeProductOrServiceProperty

Bruttogewicht Palette (Eclass-6.1)
type: ObjectProperty
domain: ProductOrService
range: QuantitativeValueFloat
comment: Merkmal "Bruttogewicht Palette" Aus Der Klassifikation "Eclass-6.1".
sub property of: quantitativeProductOrServiceProperty

Bruttogewicht Verpackungsmengeneinheit (Eclass-6.1)
type: ObjectProperty
domain: ProductOrService
range: QuantitativeValueFloat
comment: Merkmal "Bruttogewicht Verpackungsmengeneinheit" Aus Der Klassifikation "Eclass-6.1".
sub property of: quantitativeProductOrServiceProperty

Bruttoinhalt Kühlteil (Eclass-6.1)
type: ObjectProperty
domain: ProductOrService
range: QuantitativeValueFloat
comment: Merkmal "Bruttoinhalt Kühlteil" Aus Der Klassifikation "Eclass-6.1".
sub property of: quantitativeProductOrServiceProperty

Bullauge (Eclass-6.1)
type: DatatypeProperty
domain: ProductOrService
range: string
comment: Merkmal "Bullauge" Aus Der Klassifikation "Eclass-6.1".
sub property of: datatypeProductOrServiceProperty

Dekorfähigkeit Der Tür (Eclass-6.1)
type: DatatypeProperty
domain: ProductOrService
range: string
comment: Merkmal "Dekorfähigkeit Der Tür" Aus Der Klassifikation "Eclass-6.1".
sub property of: datatypeProductOrServiceProperty

Displayoptionen (Eclass-6.1)
type: DatatypeProperty
domain: ProductOrService
range: string
comment: Merkmal "Displayoptionen" Aus Der Klassifikation "Eclass-6.1".
sub property of: datatypeProductOrServiceProperty

Drehspieß Mit Motor (Eclass-6.1)
type: DatatypeProperty
domain: ProductOrService
range: string
comment: Merkmal "Drehspieß Mit Motor" Aus Der Klassifikation "Eclass-6.1".
sub property of: datatypeProductOrServiceProperty

Drehteller (Eclass-6.1)
type: DatatypeProperty
domain: ProductOrService
range: string
comment: Merkmal "Drehteller" Aus Der Klassifikation "Eclass-6.1".
sub property of: datatypeProductOrServiceProperty

Durchmesser Abluftstutzen (Eclass-6.1)
type: ObjectProperty
domain: ProductOrService
range: QuantitativeValueFloat
comment: Merkmal "Durchmesser Abluftstutzen" Aus Der Klassifikation "Eclass-6.1".
sub property of: quantitativeProductOrServiceProperty

Durchmesser Drehteller (Eclass-6.1)
type: ObjectProperty
domain: ProductOrService
range: QuantitativeValueFloat
comment: Merkmal "Durchmesser Drehteller" Aus Der Klassifikation "Eclass-6.1".
sub property of: quantitativeProductOrServiceProperty

Durchschn. Jahresverbrauch Energie (Eclass-6.1)
type: ObjectProperty
domain: ProductOrService
range: QuantitativeValueFloat
comment: Merkmal "Durchschn. Jahresverbrauch Energie" Aus Der Klassifikation "Eclass-6.1".
sub property of: quantitativeProductOrServiceProperty

Durchschn. Waschzeit Baumwolle 60 Grad C (Volle Ladung) (Eclass-6.1)
type: ObjectProperty
domain: ProductOrService
range: QuantitativeValueFloat
comment: Merkmal "Durchschn. Waschzeit Baumwolle 60 Grad C (Volle Ladung)" Aus Der Klassifikation "Eclass-6.1".
sub property of: quantitativeProductOrServiceProperty

Einzelkorbspülen (Eclass-6.1)
type: DatatypeProperty
domain: ProductOrService
range: string
comment: Merkmal "Einzelkorbspülen" Aus Der Klassifikation "Eclass-6.1".
sub property of: datatypeProductOrServiceProperty

Einzelversandfähig? (Eclass-6.1)
type: DatatypeProperty
domain: ProductOrService
range: string
comment: Merkmal "Einzelversandfähig?" Aus Der Klassifikation "Eclass-6.1".
sub property of: datatypeProductOrServiceProperty

Elektroanschlusswert (Eclass-6.1)
type: ObjectProperty
domain: ProductOrService
range: QuantitativeValueFloat
comment: Merkmal "Elektroanschlusswert" Aus Der Klassifikation "Eclass-6.1".
sub property of: quantitativeProductOrServiceProperty

Elektronik-Uhr (Eclass-6.1)
type: DatatypeProperty
domain: ProductOrService
range: string
comment: Merkmal "Elektronik-Uhr" Aus Der Klassifikation "Eclass-6.1".
sub property of: datatypeProductOrServiceProperty

Energieart (Eclass-6.1)
type: DatatypeProperty
domain: ProductOrService
range: string
comment: Merkmal "Energieart" Aus Der Klassifikation "Eclass-6.1".
sub property of: datatypeProductOrServiceProperty

Energieeffizienzklasse (Eclass-6.1)
type: DatatypeProperty
domain: ProductOrService
range: string
comment: Merkmal "Energieeffizienzklasse" Aus Der Klassifikation "Eclass-6.1".
sub property of: datatypeProductOrServiceProperty

Energiequelle (Eclass-6.1)
type: DatatypeProperty
domain: ProductOrService
range: string
comment: Merkmal "Energiequelle" Aus Der Klassifikation "Eclass-6.1".
sub property of: datatypeProductOrServiceProperty

Energieverbrauch (Eclass-6.1)
type: ObjectProperty
domain: ProductOrService
range: QuantitativeValueFloat
comment: Merkmal "Energieverbrauch" Aus Der Klassifikation "Eclass-6.1".
sub property of: quantitativeProductOrServiceProperty

Energieverbrauch 30 Grad C Feinwäsche (Eclass-6.1)
type: ObjectProperty
domain: ProductOrService
range: QuantitativeValueFloat
comment: Merkmal "Energieverbrauch 30 Grad C Feinwäsche" Aus Der Klassifikation "Eclass-6.1".
sub property of: quantitativeProductOrServiceProperty

Energieverbrauch 30 Grad C Wolle (Eclass-6.1)
type: ObjectProperty
domain: ProductOrService
range: QuantitativeValueFloat
comment: Merkmal "Energieverbrauch 30 Grad C Wolle" Aus Der Klassifikation "Eclass-6.1".
sub property of: quantitativeProductOrServiceProperty

Energieverbrauch 40 Grad C Buntwäsche (Eclass-6.1)
type: ObjectProperty
domain: ProductOrService
range: QuantitativeValueFloat
comment: Merkmal "Energieverbrauch 40 Grad C Buntwäsche" Aus Der Klassifikation "Eclass-6.1".
sub property of: quantitativeProductOrServiceProperty

Energieverbrauch 40 Grad C Pflegeleicht (Eclass-6.1)
type: ObjectProperty
domain: ProductOrService
range: QuantitativeValueFloat
comment: Merkmal "Energieverbrauch 40 Grad C Pflegeleicht" Aus Der Klassifikation "Eclass-6.1".
sub property of: quantitativeProductOrServiceProperty

Energieverbrauch 95 Grad C Baumwolle (Eclass-6.1)
type: ObjectProperty
domain: ProductOrService
range: QuantitativeValueFloat
comment: Merkmal "Energieverbrauch 95 Grad C Baumwolle" Aus Der Klassifikation "Eclass-6.1".
sub property of: quantitativeProductOrServiceProperty

Energieverbrauch Konventionelle Beheizung (Eclass-6.1)
type: ObjectProperty
domain: ProductOrService
range: QuantitativeValueFloat
comment: Merkmal "Energieverbrauch Konventionelle Beheizung" Aus Der Klassifikation "Eclass-6.1".
sub property of: quantitativeProductOrServiceProperty

Energieverbrauch (Nur Waschen Einer Vollen Waschladung) (Eclass-6.1)
type: ObjectProperty
domain: ProductOrService
range: QuantitativeValueFloat
comment: Merkmal "Energieverbrauch (Nur Waschen Einer Vollen Waschladung)" Aus Der Klassifikation "Eclass-6.1".
sub property of: quantitativeProductOrServiceProperty

Enthärtungsanlage (Eclass-6.1)
type: DatatypeProperty
domain: ProductOrService
range: string
comment: Merkmal "Enthärtungsanlage" Aus Der Klassifikation "Eclass-6.1".
sub property of: datatypeProductOrServiceProperty

Farbe Gehäuse (Eclass-6.1)
type: DatatypeProperty
domain: ProductOrService
range: string
comment: Merkmal "Farbe Gehäuse" Aus Der Klassifikation "Eclass-6.1".
sub property of: datatypeProductOrServiceProperty

Farbe Kamin (Eclass-6.1)
type: DatatypeProperty
domain: ProductOrService
range: string
comment: Merkmal "Farbe Kamin" Aus Der Klassifikation "Eclass-6.1".
sub property of: datatypeProductOrServiceProperty

Fernbedienung (Eclass-6.1)
type: DatatypeProperty
domain: ProductOrService
range: string
comment: Merkmal "Fernbedienung" Aus Der Klassifikation "Eclass-6.1".
sub property of: datatypeProductOrServiceProperty

Fertigsignal (Eclass-6.1)
type: DatatypeProperty
domain: ProductOrService
range: string
comment: Merkmal "Fertigsignal" Aus Der Klassifikation "Eclass-6.1".
sub property of: datatypeProductOrServiceProperty

Feuchtigkeitssensor (Eclass-6.1)
type: DatatypeProperty
domain: ProductOrService
range: string
comment: Merkmal "Feuchtigkeitssensor" Aus Der Klassifikation "Eclass-6.1".
sub property of: datatypeProductOrServiceProperty

Filter (Eclass-6.1)
type: DatatypeProperty
domain: ProductOrService
range: string
comment: Merkmal "Filter" Aus Der Klassifikation "Eclass-6.1".
sub property of: datatypeProductOrServiceProperty

Filter Description (Eclass-6.1)
type: DatatypeProperty
domain: ProductOrService
range: string
comment: Merkmal "Filter Description" Aus Der Klassifikation "Eclass-6.1".
sub property of: datatypeProductOrServiceProperty

Flaschenregal (Eclass-6.1)
type: DatatypeProperty
domain: ProductOrService
range: string
comment: Merkmal "Flaschenregal" Aus Der Klassifikation "Eclass-6.1".
sub property of: datatypeProductOrServiceProperty

Füllmenge Baumwolle (Eclass-6.1)
type: ObjectProperty
domain: ProductOrService
range: QuantitativeValueFloat
comment: Merkmal "Füllmenge Baumwolle" Aus Der Klassifikation "Eclass-6.1".
sub property of: quantitativeProductOrServiceProperty

Füllmenge Baumwolle Trocknen (Eclass-6.1)
type: ObjectProperty
domain: ProductOrService
range: QuantitativeValueFloat
comment: Merkmal "Füllmenge Baumwolle Trocknen" Aus Der Klassifikation "Eclass-6.1".
sub property of: quantitativeProductOrServiceProperty

Füllmenge Baumwolle Waschen (Eclass-6.1)
type: ObjectProperty
domain: ProductOrService
range: QuantitativeValueFloat
comment: Merkmal "Füllmenge Baumwolle Waschen" Aus Der Klassifikation "Eclass-6.1".
sub property of: quantitativeProductOrServiceProperty

Frostfree System (Eclass-6.1)
type: DatatypeProperty
domain: ProductOrService
range: string
comment: Merkmal "Frostfree System" Aus Der Klassifikation "Eclass-6.1".
sub property of: datatypeProductOrServiceProperty

Funktion Ohne Schleudern (Eclass-6.1)
type: DatatypeProperty
domain: ProductOrService
range: string
comment: Merkmal "Funktion Ohne Schleudern" Aus Der Klassifikation "Eclass-6.1".
sub property of: datatypeProductOrServiceProperty

Gtin (Eclass-6.1)
type: DatatypeProperty
domain: ProductOrService
range: string
comment: Merkmal "Gtin" Aus Der Klassifikation "Eclass-6.1".
sub property of: datatypeProductOrServiceProperty

Garraumfassungsvermögen (Eclass-6.1)
type: ObjectProperty
domain: ProductOrService
range: QuantitativeValueFloat
comment: Merkmal "Garraumfassungsvermögen" Aus Der Klassifikation "Eclass-6.1".
sub property of: quantitativeProductOrServiceProperty

Garzeit Stufenlos Einstellbar (Eclass-6.1)
type: DatatypeProperty
domain: ProductOrService
range: string
comment: Merkmal "Garzeit Stufenlos Einstellbar" Aus Der Klassifikation "Eclass-6.1".
sub property of: datatypeProductOrServiceProperty

Gasanschlusswert (Eclass-6.1)
type: ObjectProperty
domain: ProductOrService
range: QuantitativeValueFloat
comment: Merkmal "Gasanschlusswert" Aus Der Klassifikation "Eclass-6.1".
sub property of: quantitativeProductOrServiceProperty

Gasart (Eclass-6.1)
type: DatatypeProperty
domain: ProductOrService
range: string
comment: Merkmal "Gasart" Aus Der Klassifikation "Eclass-6.1".
sub property of: datatypeProductOrServiceProperty

Gebläseleistung Bei Intensivstufe (Abluftbetrieb) (Eclass-6.1)
type: ObjectProperty
domain: ProductOrService
range: QuantitativeValueFloat
comment: Merkmal "Gebläseleistung Bei Intensivstufe (Abluftbetrieb)" Aus Der Klassifikation "Eclass-6.1".
sub property of: quantitativeProductOrServiceProperty

Gebläseleistung Bei Intensivstufe (Umluftbetrieb) (Eclass-6.1)
type: ObjectProperty
domain: ProductOrService
range: QuantitativeValueFloat
comment: Merkmal "Gebläseleistung Bei Intensivstufe (Umluftbetrieb)" Aus Der Klassifikation "Eclass-6.1".
sub property of: quantitativeProductOrServiceProperty

Gefrierteil Mit Tauwasserablauf (Eclass-6.1)
type: DatatypeProperty
domain: ProductOrService
range: string
comment: Merkmal "Gefrierteil Mit Tauwasserablauf" Aus Der Klassifikation "Eclass-6.1".
sub property of: datatypeProductOrServiceProperty

Geräteart (Eclass-6.1)
type: DatatypeProperty
domain: ProductOrService
range: string
comment: Merkmal "Geräteart" Aus Der Klassifikation "Eclass-6.1".
sub property of: datatypeProductOrServiceProperty

Gerätebreite (Eclass-6.1)
type: ObjectProperty
domain: ProductOrService
range: QuantitativeValueFloat
comment: Merkmal "Gerätebreite" Aus Der Klassifikation "Eclass-6.1".
sub property of: quantitativeProductOrServiceProperty

Gerätebreite Verpackt (Eclass-6.1)
type: ObjectProperty
domain: ProductOrService
range: QuantitativeValueFloat
comment: Merkmal "Gerätebreite Verpackt" Aus Der Klassifikation "Eclass-6.1".
sub property of: quantitativeProductOrServiceProperty

Gerätefarbe (Eclass-6.1)
type: DatatypeProperty
domain: ProductOrService
range: string
comment: Merkmal "Gerätefarbe" Aus Der Klassifikation "Eclass-6.1".
sub property of: datatypeProductOrServiceProperty

Gerätehöhe (Eclass-6.1)
type: ObjectProperty
domain: ProductOrService
range: QuantitativeValueFloat
comment: Merkmal "Gerätehöhe" Aus Der Klassifikation "Eclass-6.1".
sub property of: quantitativeProductOrServiceProperty

Gerätehöhe Verpackt (Eclass-6.1)
type: ObjectProperty
domain: ProductOrService
range: QuantitativeValueFloat
comment: Merkmal "Gerätehöhe Verpackt" Aus Der Klassifikation "Eclass-6.1".
sub property of: quantitativeProductOrServiceProperty

Gerätetiefe (Eclass-6.1)
type: ObjectProperty
domain: ProductOrService
range: QuantitativeValueFloat
comment: Merkmal "Gerätetiefe" Aus Der Klassifikation "Eclass-6.1".
sub property of: quantitativeProductOrServiceProperty

Gerätetiefe Bei Geöffneter Tür (Eclass-6.1)
type: ObjectProperty
domain: ProductOrService
range: QuantitativeValueFloat
comment: Merkmal "Gerätetiefe Bei Geöffneter Tür" Aus Der Klassifikation "Eclass-6.1".
sub property of: quantitativeProductOrServiceProperty

Gerätetiefe Verpackt (Eclass-6.1)
type: ObjectProperty
domain: ProductOrService
range: QuantitativeValueFloat
comment: Merkmal "Gerätetiefe Verpackt" Aus Der Klassifikation "Eclass-6.1".
sub property of: quantitativeProductOrServiceProperty

Gerätetyp Trockner (Eclass-6.1)
type: DatatypeProperty
domain: ProductOrService
range: string
comment: Merkmal "Gerätetyp Trockner" Aus Der Klassifikation "Eclass-6.1".
sub property of: datatypeProductOrServiceProperty

Geruchsfilter (Eclass-6.1)
type: DatatypeProperty
domain: ProductOrService
range: string
comment: Merkmal "Geruchsfilter" Aus Der Klassifikation "Eclass-6.1".
sub property of: datatypeProductOrServiceProperty

Gesamtgebläseleistung (Eclass-6.1)
type: ObjectProperty
domain: ProductOrService
range: QuantitativeValueFloat
comment: Merkmal "Gesamtgebläseleistung" Aus Der Klassifikation "Eclass-6.1".
sub property of: quantitativeProductOrServiceProperty

Gesamtleistung Lampen (Eclass-6.1)
type: ObjectProperty
domain: ProductOrService
range: QuantitativeValueFloat
comment: Merkmal "Gesamtleistung Lampen" Aus Der Klassifikation "Eclass-6.1".
sub property of: quantitativeProductOrServiceProperty

Getrennte Temperaturwahl Möglich (Eclass-6.1)
type: DatatypeProperty
domain: ProductOrService
range: string
comment: Merkmal "Getrennte Temperaturwahl Möglich" Aus Der Klassifikation "Eclass-6.1".
sub property of: datatypeProductOrServiceProperty

Gewichtserkennung (Eclass-6.1)
type: DatatypeProperty
domain: ProductOrService
range: string
comment: Merkmal "Gewichtserkennung" Aus Der Klassifikation "Eclass-6.1".
sub property of: datatypeProductOrServiceProperty

Größe (Eclass-6.1)
type: DatatypeProperty
domain: ProductOrService
range: string
comment: Merkmal "Größe" Aus Der Klassifikation "Eclass-6.1".
sub property of: datatypeProductOrServiceProperty

Grillart (Eclass-6.1)
type: DatatypeProperty
domain: ProductOrService
range: string
comment: Merkmal "Grillart" Aus Der Klassifikation "Eclass-6.1".
sub property of: datatypeProductOrServiceProperty

Grillleistung (Eclass-6.1)
type: ObjectProperty
domain: ProductOrService
range: QuantitativeValueFloat
comment: Merkmal "Grillleistung" Aus Der Klassifikation "Eclass-6.1".
sub property of: quantitativeProductOrServiceProperty

Hauptschalter Vorhanden (Eclass-6.1)
type: DatatypeProperty
domain: ProductOrService
range: string
comment: Merkmal "Hauptschalter Vorhanden" Aus Der Klassifikation "Eclass-6.1".
sub property of: datatypeProductOrServiceProperty

Höhe Garraum (Eclass-6.1)
type: ObjectProperty
domain: ProductOrService
range: QuantitativeValueFloat
comment: Merkmal "Höhe Garraum" Aus Der Klassifikation "Eclass-6.1".
sub property of: quantitativeProductOrServiceProperty

Höhe Geräte Ohne Kamin (Eclass-6.1)
type: ObjectProperty
domain: ProductOrService
range: QuantitativeValueFloat
comment: Merkmal "Höhe Geräte Ohne Kamin" Aus Der Klassifikation "Eclass-6.1".
sub property of: quantitativeProductOrServiceProperty

Höhe Kamin (Eclass-6.1)
type: ObjectProperty
domain: ProductOrService
range: QuantitativeValueFloat
comment: Merkmal "Höhe Kamin" Aus Der Klassifikation "Eclass-6.1".
sub property of: quantitativeProductOrServiceProperty

Höhe Der Abnehmbaren Arbeitsplatte (Eclass-6.1)
type: ObjectProperty
domain: ProductOrService
range: QuantitativeValueFloat
comment: Merkmal "Höhe Der Abnehmbaren Arbeitsplatte" Aus Der Klassifikation "Eclass-6.1".
sub property of: quantitativeProductOrServiceProperty

Hochschrank Einbau (Eclass-6.1)
type: DatatypeProperty
domain: ProductOrService
range: string
comment: Merkmal "Hochschrank Einbau" Aus Der Klassifikation "Eclass-6.1".
sub property of: datatypeProductOrServiceProperty

Innenbeleuchtung (Eclass-6.1)
type: DatatypeProperty
domain: ProductOrService
range: string
comment: Merkmal "Innenbeleuchtung" Aus Der Klassifikation "Eclass-6.1".
sub property of: datatypeProductOrServiceProperty

Innenlüfter (Eclass-6.1)
type: DatatypeProperty
domain: ProductOrService
range: string
comment: Merkmal "Innenlüfter" Aus Der Klassifikation "Eclass-6.1".
sub property of: datatypeProductOrServiceProperty

Innenlüfter (Kühlteil) (Eclass-6.1)
type: DatatypeProperty
domain: ProductOrService
range: string
comment: Merkmal "Innenlüfter (Kühlteil)" Aus Der Klassifikation "Eclass-6.1".
sub property of: datatypeProductOrServiceProperty

Integrierte Kochfeldsteuereinheiten (Eclass-6.1)
type: DatatypeProperty
domain: ProductOrService
range: string
comment: Merkmal "Integrierte Kochfeldsteuereinheiten" Aus Der Klassifikation "Eclass-6.1".
sub property of: datatypeProductOrServiceProperty

Integriertes Reinigungssystem (Eclass-6.1)
type: DatatypeProperty
domain: ProductOrService
range: string
comment: Merkmal "Integriertes Reinigungssystem" Aus Der Klassifikation "Eclass-6.1".
sub property of: datatypeProductOrServiceProperty

Intensivstufe (Eclass-6.1)
type: DatatypeProperty
domain: ProductOrService
range: string
comment: Merkmal "Intensivstufe" Aus Der Klassifikation "Eclass-6.1".
sub property of: datatypeProductOrServiceProperty

Kalt-,Warmwasseranschluss (Eclass-6.1)
type: DatatypeProperty
domain: ProductOrService
range: string
comment: Merkmal "Kalt-,Warmwasseranschluss" Aus Der Klassifikation "Eclass-6.1".
sub property of: datatypeProductOrServiceProperty

Kaltwäsche (Eclass-6.1)
type: DatatypeProperty
domain: ProductOrService
range: string
comment: Merkmal "Kaltwäsche" Aus Der Klassifikation "Eclass-6.1".
sub property of: datatypeProductOrServiceProperty

Klarspülmangelanzeige (Eclass-6.1)
type: DatatypeProperty
domain: ProductOrService
range: string
comment: Merkmal "Klarspülmangelanzeige" Aus Der Klassifikation "Eclass-6.1".
sub property of: datatypeProductOrServiceProperty

Klimaklasse (Eclass-6.1)
type: DatatypeProperty
domain: ProductOrService
range: string
comment: Merkmal "Klimaklasse" Aus Der Klassifikation "Eclass-6.1".
sub property of: datatypeProductOrServiceProperty

Knitterschutzsystem (Eclass-6.1)
type: DatatypeProperty
domain: ProductOrService
range: string
comment: Merkmal "Knitterschutzsystem" Aus Der Klassifikation "Eclass-6.1".
sub property of: datatypeProductOrServiceProperty

Kochfeldart (Eclass-6.1)
type: DatatypeProperty
domain: ProductOrService
range: string
comment: Merkmal "Kochfeldart" Aus Der Klassifikation "Eclass-6.1".
sub property of: datatypeProductOrServiceProperty

Kochzonen-Kontrollleuchte (Eclass-6.1)
type: DatatypeProperty
domain: ProductOrService
range: string
comment: Merkmal "Kochzonen-Kontrollleuchte" Aus Der Klassifikation "Eclass-6.1".
sub property of: datatypeProductOrServiceProperty

Kombination Mit Herden/Backoefen Möglich (Eclass-6.1)
type: DatatypeProperty
domain: ProductOrService
range: string
comment: Merkmal "Kombination Mit Herden/Backoefen Möglich" Aus Der Klassifikation "Eclass-6.1".
sub property of: datatypeProductOrServiceProperty

Kombination Mit Kochfeldern Möglich (Eclass-6.1)
type: DatatypeProperty
domain: ProductOrService
range: string
comment: Merkmal "Kombination Mit Kochfeldern Möglich" Aus Der Klassifikation "Eclass-6.1".
sub property of: datatypeProductOrServiceProperty

Kontrollanzeige Für Behälter Entleeren (Eclass-6.1)
type: DatatypeProperty
domain: ProductOrService
range: string
comment: Merkmal "Kontrollanzeige Für Behälter Entleeren" Aus Der Klassifikation "Eclass-6.1".
sub property of: datatypeProductOrServiceProperty

Korbgriff (Eclass-6.1)
type: DatatypeProperty
domain: ProductOrService
range: string
comment: Merkmal "Korbgriff" Aus Der Klassifikation "Eclass-6.1".
sub property of: datatypeProductOrServiceProperty

Lage Abluftaustritt (Eclass-6.1)
type: DatatypeProperty
domain: ProductOrService
range: string
comment: Merkmal "Lage Abluftaustritt" Aus Der Klassifikation "Eclass-6.1".
sub property of: datatypeProductOrServiceProperty

Lage Der 1. Kochzone (Eclass-6.1)
type: DatatypeProperty
domain: ProductOrService
range: string
comment: Merkmal "Lage Der 1. Kochzone" Aus Der Klassifikation "Eclass-6.1".
sub property of: datatypeProductOrServiceProperty

Lage Der 2. Kochzone (Eclass-6.1)
type: DatatypeProperty
domain: ProductOrService
range: string
comment: Merkmal "Lage Der 2. Kochzone" Aus Der Klassifikation "Eclass-6.1".
sub property of: datatypeProductOrServiceProperty

Lage Der 3. Kochzone (Eclass-6.1)
type: DatatypeProperty
domain: ProductOrService
range: string
comment: Merkmal "Lage Der 3. Kochzone" Aus Der Klassifikation "Eclass-6.1".
sub property of: datatypeProductOrServiceProperty

Lage Der 4. Kochzone (Eclass-6.1)
type: DatatypeProperty
domain: ProductOrService
range: string
comment: Merkmal "Lage Der 4. Kochzone" Aus Der Klassifikation "Eclass-6.1".
sub property of: datatypeProductOrServiceProperty

Lage Der 5. Kochzone (Eclass-6.1)
type: DatatypeProperty
domain: ProductOrService
range: string
comment: Merkmal "Lage Der 5. Kochzone" Aus Der Klassifikation "Eclass-6.1".
sub property of: datatypeProductOrServiceProperty

Lage Der 6. Kochzone (Eclass-6.1)
type: DatatypeProperty
domain: ProductOrService
range: string
comment: Merkmal "Lage Der 6. Kochzone" Aus Der Klassifikation "Eclass-6.1".
sub property of: datatypeProductOrServiceProperty

Lage Der Steuerung (Eclass-6.1)
type: DatatypeProperty
domain: ProductOrService
range: string
comment: Merkmal "Lage Der Steuerung" Aus Der Klassifikation "Eclass-6.1".
sub property of: datatypeProductOrServiceProperty

Leistung Der 1. Kochzone (Eclass-6.1)
type: ObjectProperty
domain: ProductOrService
range: QuantitativeValueFloat
comment: Merkmal "Leistung Der 1. Kochzone" Aus Der Klassifikation "Eclass-6.1".
sub property of: quantitativeProductOrServiceProperty

Leistung Der 2. Kochzone (Eclass-6.1)
type: ObjectProperty
domain: ProductOrService
range: QuantitativeValueFloat
comment: Merkmal "Leistung Der 2. Kochzone" Aus Der Klassifikation "Eclass-6.1".
sub property of: quantitativeProductOrServiceProperty

Leistung Der 3. Kochzone (Eclass-6.1)
type: ObjectProperty
domain: ProductOrService
range: QuantitativeValueFloat
comment: Merkmal "Leistung Der 3. Kochzone" Aus Der Klassifikation "Eclass-6.1".
sub property of: quantitativeProductOrServiceProperty

Leistung Der 4. Kochzone (Eclass-6.1)
type: ObjectProperty
domain: ProductOrService
range: QuantitativeValueFloat
comment: Merkmal "Leistung Der 4. Kochzone" Aus Der Klassifikation "Eclass-6.1".
sub property of: quantitativeProductOrServiceProperty

Leistung Der 5. Kochzone (Eclass-6.1)
type: ObjectProperty
domain: ProductOrService
range: QuantitativeValueFloat
comment: Merkmal "Leistung Der 5. Kochzone" Aus Der Klassifikation "Eclass-6.1".
sub property of: quantitativeProductOrServiceProperty

Leistung Der 6. Kochzone (Eclass-6.1)
type: ObjectProperty
domain: ProductOrService
range: QuantitativeValueFloat
comment: Merkmal "Leistung Der 6. Kochzone" Aus Der Klassifikation "Eclass-6.1".
sub property of: quantitativeProductOrServiceProperty

Länge Ablaufschlauch (Eclass-6.1)
type: ObjectProperty
domain: ProductOrService
range: QuantitativeValueFloat
comment: Merkmal "Länge Ablaufschlauch" Aus Der Klassifikation "Eclass-6.1".
sub property of: quantitativeProductOrServiceProperty

Länge Abluftschlauch (Eclass-6.1)
type: ObjectProperty
domain: ProductOrService
range: QuantitativeValueFloat
comment: Merkmal "Länge Abluftschlauch" Aus Der Klassifikation "Eclass-6.1".
sub property of: quantitativeProductOrServiceProperty

Länge Anschlusskabel (Eclass-6.1)
type: ObjectProperty
domain: ProductOrService
range: QuantitativeValueFloat
comment: Merkmal "Länge Anschlusskabel" Aus Der Klassifikation "Eclass-6.1".
sub property of: quantitativeProductOrServiceProperty

Länge Netzkabel (Cm) (Eclass-6.1)
type: ObjectProperty
domain: ProductOrService
range: QuantitativeValueFloat
comment: Merkmal "Länge Netzkabel (Cm)" Aus Der Klassifikation "Eclass-6.1".
sub property of: quantitativeProductOrServiceProperty

Länge Zulaufschlauch (Eclass-6.1)
type: ObjectProperty
domain: ProductOrService
range: QuantitativeValueFloat
comment: Merkmal "Länge Zulaufschlauch" Aus Der Klassifikation "Eclass-6.1".
sub property of: quantitativeProductOrServiceProperty

Maße Der Verpackungsmengeneinheit / Umkarton (Eclass-6.1)
type: ObjectProperty
domain: ProductOrService
range: QuantitativeValueFloat
comment: Merkmal "Maße Der Verpackungsmengeneinheit / Umkarton" Aus Der Klassifikation "Eclass-6.1".
sub property of: quantitativeProductOrServiceProperty

Manuelle Bedienelemente (Eclass-6.1)
type: DatatypeProperty
domain: ProductOrService
range: string
comment: Merkmal "Manuelle Bedienelemente" Aus Der Klassifikation "Eclass-6.1".
sub property of: datatypeProductOrServiceProperty

Marke (Eclass-6.1)
type: DatatypeProperty
domain: ProductOrService
range: string
comment: Merkmal "Marke" Aus Der Klassifikation "Eclass-6.1".
sub property of: datatypeProductOrServiceProperty

Material Blende (Eclass-6.1)
type: DatatypeProperty
domain: ProductOrService
range: string
comment: Merkmal "Material Blende" Aus Der Klassifikation "Eclass-6.1".
sub property of: datatypeProductOrServiceProperty

Material Fettfilter (Eclass-6.1)
type: DatatypeProperty
domain: ProductOrService
range: string
comment: Merkmal "Material Fettfilter" Aus Der Klassifikation "Eclass-6.1".
sub property of: datatypeProductOrServiceProperty

Material Garraum (Eclass-6.1)
type: DatatypeProperty
domain: ProductOrService
range: string
comment: Merkmal "Material Garraum" Aus Der Klassifikation "Eclass-6.1".
sub property of: datatypeProductOrServiceProperty

Material Gehäuse (Eclass-6.1)
type: DatatypeProperty
domain: ProductOrService
range: string
comment: Merkmal "Material Gehäuse" Aus Der Klassifikation "Eclass-6.1".
sub property of: datatypeProductOrServiceProperty

Material Grillfläche (Eclass-6.1)
type: DatatypeProperty
domain: ProductOrService
range: string
comment: Merkmal "Material Grillfläche" Aus Der Klassifikation "Eclass-6.1".
sub property of: datatypeProductOrServiceProperty

Material Heizschale (Eclass-6.1)
type: DatatypeProperty
domain: ProductOrService
range: string
comment: Merkmal "Material Heizschale" Aus Der Klassifikation "Eclass-6.1".
sub property of: datatypeProductOrServiceProperty

Material Kamin (Eclass-6.1)
type: DatatypeProperty
domain: ProductOrService
range: string
comment: Merkmal "Material Kamin" Aus Der Klassifikation "Eclass-6.1".
sub property of: datatypeProductOrServiceProperty

Material Laugenbehälter (Eclass-6.1)
type: DatatypeProperty
domain: ProductOrService
range: string
comment: Merkmal "Material Laugenbehälter" Aus Der Klassifikation "Eclass-6.1".
sub property of: datatypeProductOrServiceProperty

Material Sichtfenster (Eclass-6.1)
type: DatatypeProperty
domain: ProductOrService
range: string
comment: Merkmal "Material Sichtfenster" Aus Der Klassifikation "Eclass-6.1".
sub property of: datatypeProductOrServiceProperty

Material Der Ablagen (Eclass-6.1)
type: DatatypeProperty
domain: ProductOrService
range: string
comment: Merkmal "Material Der Ablagen" Aus Der Klassifikation "Eclass-6.1".
sub property of: datatypeProductOrServiceProperty

Material Der Tür (Eclass-6.1)
type: DatatypeProperty
domain: ProductOrService
range: string
comment: Merkmal "Material Der Tür" Aus Der Klassifikation "Eclass-6.1".
sub property of: datatypeProductOrServiceProperty

Max. Gebläseleistung (Abluftbetrieb) (Eclass-6.1)
type: ObjectProperty
domain: ProductOrService
range: QuantitativeValueFloat
comment: Merkmal "Max. Gebläseleistung (Abluftbetrieb)" Aus Der Klassifikation "Eclass-6.1".
sub property of: quantitativeProductOrServiceProperty

Max. Gebläseleistung (Umluftbetrieb) (Eclass-6.1)
type: ObjectProperty
domain: ProductOrService
range: QuantitativeValueFloat
comment: Merkmal "Max. Gebläseleistung (Umluftbetrieb)" Aus Der Klassifikation "Eclass-6.1".
sub property of: quantitativeProductOrServiceProperty

Max. Elektrische Leistungsaufnahme (W) (Eclass-6.1)
type: ObjectProperty
domain: ProductOrService
range: QuantitativeValueFloat
comment: Merkmal "Max. Elektrische Leistungsaufnahme (W)" Aus Der Klassifikation "Eclass-6.1".
sub property of: quantitativeProductOrServiceProperty

Möbeltürbefestigung (Eclass-6.1)
type: DatatypeProperty
domain: ProductOrService
range: string
comment: Merkmal "Möbeltürbefestigung" Aus Der Klassifikation "Eclass-6.1".
sub property of: datatypeProductOrServiceProperty

Mitgeliefertes Zubehör (Eclass-6.1)
type: DatatypeProperty
domain: ProductOrService
range: string
comment: Merkmal "Mitgeliefertes Zubehör" Aus Der Klassifikation "Eclass-6.1".
sub property of: datatypeProductOrServiceProperty

Nettofassungsvermögen (Anderes Separates Fach) (Eclass-6.1)
type: ObjectProperty
domain: ProductOrService
range: QuantitativeValueFloat
comment: Merkmal "Nettofassungsvermögen (Anderes Separates Fach)" Aus Der Klassifikation "Eclass-6.1".
sub property of: quantitativeProductOrServiceProperty

Nettofassungsvermögen (Metrisch) (Eclass-6.1)
type: ObjectProperty
domain: ProductOrService
range: QuantitativeValueFloat
comment: Merkmal "Nettofassungsvermögen (Metrisch)" Aus Der Klassifikation "Eclass-6.1".
sub property of: quantitativeProductOrServiceProperty

Nettogewicht (Eclass-6.1)
type: ObjectProperty
domain: ProductOrService
range: QuantitativeValueFloat
comment: Merkmal "Nettogewicht" Aus Der Klassifikation "Eclass-6.1".
sub property of: quantitativeProductOrServiceProperty

Nettovolumen (Eclass-6.1)
type: ObjectProperty
domain: ProductOrService
range: QuantitativeValueFloat
comment: Merkmal "Nettovolumen" Aus Der Klassifikation "Eclass-6.1".
sub property of: quantitativeProductOrServiceProperty

Nischentiefe (Eclass-6.1)
type: ObjectProperty
domain: ProductOrService
range: QuantitativeValueFloat
comment: Merkmal "Nischentiefe" Aus Der Klassifikation "Eclass-6.1".
sub property of: quantitativeProductOrServiceProperty

Ober- Und Unterhitze (Eclass-6.1)
type: DatatypeProperty
domain: ProductOrService
range: string
comment: Merkmal "Ober- Und Unterhitze" Aus Der Klassifikation "Eclass-6.1".
sub property of: datatypeProductOrServiceProperty

Oberkorb Verstellbar (Eclass-6.1)
type: DatatypeProperty
domain: ProductOrService
range: string
comment: Merkmal "Oberkorb Verstellbar" Aus Der Klassifikation "Eclass-6.1".
sub property of: datatypeProductOrServiceProperty

Optionales Zubehör (Eclass-6.1)
type: DatatypeProperty
domain: ProductOrService
range: string
comment: Merkmal "Optionales Zubehör" Aus Der Klassifikation "Eclass-6.1".
sub property of: datatypeProductOrServiceProperty

Position Innenbeleuchtung (Eclass-6.1)
type: DatatypeProperty
domain: ProductOrService
range: string
comment: Merkmal "Position Innenbeleuchtung" Aus Der Klassifikation "Eclass-6.1".
sub property of: datatypeProductOrServiceProperty

Primärfarbe (Eclass-6.1)
type: DatatypeProperty
domain: ProductOrService
range: string
comment: Merkmal "Primärfarbe" Aus Der Klassifikation "Eclass-6.1".
sub property of: datatypeProductOrServiceProperty

Produktfamilie (Eclass-6.1)
type: DatatypeProperty
domain: ProductOrService
range: string
comment: Merkmal "Produktfamilie" Aus Der Klassifikation "Eclass-6.1".
sub property of: datatypeProductOrServiceProperty

Produktkategorie (Eclass-6.1)
type: DatatypeProperty
domain: ProductOrService
range: string
comment: Merkmal "Produktkategorie" Aus Der Klassifikation "Eclass-6.1".
sub property of: datatypeProductOrServiceProperty

Produkttyp (Eclass-6.1)
type: DatatypeProperty
domain: ProductOrService
range: string
comment: Merkmal "Produkttyp" Aus Der Klassifikation "Eclass-6.1".
sub property of: datatypeProductOrServiceProperty

Programmablaufanzeige (Eclass-6.1)
type: DatatypeProperty
domain: ProductOrService
range: string
comment: Merkmal "Programmablaufanzeige" Aus Der Klassifikation "Eclass-6.1".
sub property of: datatypeProductOrServiceProperty

Programmdauer Vergleichsprogramm (Eclass-6.1)
type: ObjectProperty
domain: ProductOrService
range: QuantitativeValueFloat
comment: Merkmal "Programmdauer Vergleichsprogramm" Aus Der Klassifikation "Eclass-6.1".
sub property of: quantitativeProductOrServiceProperty

Rahmenausführung (Eclass-6.1)
type: DatatypeProperty
domain: ProductOrService
range: string
comment: Merkmal "Rahmenausführung" Aus Der Klassifikation "Eclass-6.1".
sub property of: datatypeProductOrServiceProperty

Rahmenfarbe (Eclass-6.1)
type: DatatypeProperty
domain: ProductOrService
range: string
comment: Merkmal "Rahmenfarbe" Aus Der Klassifikation "Eclass-6.1".
sub property of: datatypeProductOrServiceProperty

Rückstauklappe (Eclass-6.1)
type: DatatypeProperty
domain: ProductOrService
range: string
comment: Merkmal "Rückstauklappe" Aus Der Klassifikation "Eclass-6.1".
sub property of: datatypeProductOrServiceProperty

Regelung Der Leistungsstufen (Eclass-6.1)
type: DatatypeProperty
domain: ProductOrService
range: string
comment: Merkmal "Regelung Der Leistungsstufen" Aus Der Klassifikation "Eclass-6.1".
sub property of: datatypeProductOrServiceProperty

Reinigungsklasse (Eclass-6.1)
type: DatatypeProperty
domain: ProductOrService
range: string
comment: Merkmal "Reinigungsklasse" Aus Der Klassifikation "Eclass-6.1".
sub property of: datatypeProductOrServiceProperty

Restwärmeanzeige (Eclass-6.1)
type: DatatypeProperty
domain: ProductOrService
range: string
comment: Merkmal "Restwärmeanzeige" Aus Der Klassifikation "Eclass-6.1".
sub property of: datatypeProductOrServiceProperty

Restzeitanzeige (Eclass-6.1)
type: DatatypeProperty
domain: ProductOrService
range: string
comment: Merkmal "Restzeitanzeige" Aus Der Klassifikation "Eclass-6.1".
sub property of: datatypeProductOrServiceProperty

Reversierfunktion (Eclass-6.1)
type: DatatypeProperty
domain: ProductOrService
range: string
comment: Merkmal "Reversierfunktion" Aus Der Klassifikation "Eclass-6.1".
sub property of: datatypeProductOrServiceProperty

Salzmangelanzeige (Eclass-6.1)
type: DatatypeProperty
domain: ProductOrService
range: string
comment: Merkmal "Salzmangelanzeige" Aus Der Klassifikation "Eclass-6.1".
sub property of: datatypeProductOrServiceProperty

Schallleistung Schleudern Bewertet A (Eclass-6.1)
type: ObjectProperty
domain: ProductOrService
range: QuantitativeValueFloat
comment: Merkmal "Schallleistung Schleudern Bewertet A" Aus Der Klassifikation "Eclass-6.1".
sub property of: quantitativeProductOrServiceProperty

Schallleistung Trocknen Bewertet A (Eclass-6.1)
type: ObjectProperty
domain: ProductOrService
range: QuantitativeValueFloat
comment: Merkmal "Schallleistung Trocknen Bewertet A" Aus Der Klassifikation "Eclass-6.1".
sub property of: quantitativeProductOrServiceProperty

Schallleistung Waschen Bewertet A (Eclass-6.1)
type: ObjectProperty
domain: ProductOrService
range: QuantitativeValueFloat
comment: Merkmal "Schallleistung Waschen Bewertet A" Aus Der Klassifikation "Eclass-6.1".
sub property of: quantitativeProductOrServiceProperty

Schallleistung Bewertet A (Eclass-6.1)
type: ObjectProperty
domain: ProductOrService
range: QuantitativeValueFloat
comment: Merkmal "Schallleistung Bewertet A" Aus Der Klassifikation "Eclass-6.1".
sub property of: quantitativeProductOrServiceProperty

Schalter Innenbeleuchtung (Eclass-6.1)
type: DatatypeProperty
domain: ProductOrService
range: string
comment: Merkmal "Schalter Innenbeleuchtung" Aus Der Klassifikation "Eclass-6.1".
sub property of: datatypeProductOrServiceProperty

Schaumerkennung (Eclass-6.1)
type: DatatypeProperty
domain: ProductOrService
range: string
comment: Merkmal "Schaumerkennung" Aus Der Klassifikation "Eclass-6.1".
sub property of: datatypeProductOrServiceProperty

Schleuderdrehzahl Optionen (Eclass-6.1)
type: DatatypeProperty
domain: ProductOrService
range: string
comment: Merkmal "Schleuderdrehzahl Optionen" Aus Der Klassifikation "Eclass-6.1".
sub property of: datatypeProductOrServiceProperty

Schleuderwirkungsklasse (Eclass-6.1)
type: DatatypeProperty
domain: ProductOrService
range: string
comment: Merkmal "Schleuderwirkungsklasse" Aus Der Klassifikation "Eclass-6.1".
sub property of: datatypeProductOrServiceProperty

Schnelltrocknung (Eclass-6.1)
type: DatatypeProperty
domain: ProductOrService
range: string
comment: Merkmal "Schnelltrocknung" Aus Der Klassifikation "Eclass-6.1".
sub property of: datatypeProductOrServiceProperty

Schongang (Eclass-6.1)
type: DatatypeProperty
domain: ProductOrService
range: string
comment: Merkmal "Schongang" Aus Der Klassifikation "Eclass-6.1".
sub property of: datatypeProductOrServiceProperty

Sekundärfarbe (Eclass-6.1)
type: DatatypeProperty
domain: ProductOrService
range: string
comment: Merkmal "Sekundärfarbe" Aus Der Klassifikation "Eclass-6.1".
sub property of: datatypeProductOrServiceProperty

Sicherheitsfunktion (Eclass-6.1)
type: DatatypeProperty
domain: ProductOrService
range: string
comment: Merkmal "Sicherheitsfunktion" Aus Der Klassifikation "Eclass-6.1".
sub property of: datatypeProductOrServiceProperty

Speicherfunktion Bei Stromausfall (Eclass-6.1)
type: DatatypeProperty
domain: ProductOrService
range: string
comment: Merkmal "Speicherfunktion Bei Stromausfall" Aus Der Klassifikation "Eclass-6.1".
sub property of: datatypeProductOrServiceProperty

Speisenthermometer (Eclass-6.1)
type: DatatypeProperty
domain: ProductOrService
range: string
comment: Merkmal "Speisenthermometer" Aus Der Klassifikation "Eclass-6.1".
sub property of: datatypeProductOrServiceProperty

Standardmenge Pro Palette (Eclass-6.1)
type: DatatypeProperty
domain: ProductOrService
range: string
comment: Merkmal "Standardmenge Pro Palette" Aus Der Klassifikation "Eclass-6.1".
sub property of: datatypeProductOrServiceProperty

Startzeitvorwahl (Eclass-6.1)
type: DatatypeProperty
domain: ProductOrService
range: string
comment: Merkmal "Startzeitvorwahl" Aus Der Klassifikation "Eclass-6.1".
sub property of: datatypeProductOrServiceProperty

Steckertyp (Eclass-6.1)
type: DatatypeProperty
domain: ProductOrService
range: string
comment: Merkmal "Steckertyp" Aus Der Klassifikation "Eclass-6.1".
sub property of: datatypeProductOrServiceProperty

Sternekennzeichnung (Eclass-6.1)
type: DatatypeProperty
domain: ProductOrService
range: string
comment: Merkmal "Sternekennzeichnung" Aus Der Klassifikation "Eclass-6.1".
sub property of: datatypeProductOrServiceProperty

Steuerung (Eclass-6.1)
type: DatatypeProperty
domain: ProductOrService
range: string
comment: Merkmal "Steuerung" Aus Der Klassifikation "Eclass-6.1".
sub property of: datatypeProductOrServiceProperty

Steuerung Der Beleuchtung (Eclass-6.1)
type: DatatypeProperty
domain: ProductOrService
range: string
comment: Merkmal "Steuerung Der Beleuchtung" Aus Der Klassifikation "Eclass-6.1".
sub property of: datatypeProductOrServiceProperty

Superkühlentaste (Eclass-6.1)
type: DatatypeProperty
domain: ProductOrService
range: string
comment: Merkmal "Superkühlentaste" Aus Der Klassifikation "Eclass-6.1".
sub property of: datatypeProductOrServiceProperty

Tellerdurchmesser Maßgedeck (Eclass-6.1)
type: ObjectProperty
domain: ProductOrService
range: QuantitativeValueFloat
comment: Merkmal "Tellerdurchmesser Maßgedeck" Aus Der Klassifikation "Eclass-6.1".
sub property of: quantitativeProductOrServiceProperty

Temperaturanzeige (Eclass-6.1)
type: DatatypeProperty
domain: ProductOrService
range: string
comment: Merkmal "Temperaturanzeige" Aus Der Klassifikation "Eclass-6.1".
sub property of: datatypeProductOrServiceProperty

Temperatur Regelbar (Eclass-6.1)
type: DatatypeProperty
domain: ProductOrService
range: string
comment: Merkmal "Temperatur Regelbar" Aus Der Klassifikation "Eclass-6.1".
sub property of: datatypeProductOrServiceProperty

Temperatur Regelbar (Gefrierteil) (Eclass-6.1)
type: DatatypeProperty
domain: ProductOrService
range: string
comment: Merkmal "Temperatur Regelbar (Gefrierteil)" Aus Der Klassifikation "Eclass-6.1".
sub property of: datatypeProductOrServiceProperty

Temperatursteuerung (Eclass-6.1)
type: DatatypeProperty
domain: ProductOrService
range: string
comment: Merkmal "Temperatursteuerung" Aus Der Klassifikation "Eclass-6.1".
sub property of: datatypeProductOrServiceProperty

Thermometer Im Weinteil (Eclass-6.1)
type: DatatypeProperty
domain: ProductOrService
range: string
comment: Merkmal "Thermometer Im Weinteil" Aus Der Klassifikation "Eclass-6.1".
sub property of: datatypeProductOrServiceProperty

Tiefe Garraum (Eclass-6.1)
type: ObjectProperty
domain: ProductOrService
range: QuantitativeValueFloat
comment: Merkmal "Tiefe Garraum" Aus Der Klassifikation "Eclass-6.1".
sub property of: quantitativeProductOrServiceProperty

Türanschlag (Eclass-6.1)
type: DatatypeProperty
domain: ProductOrService
range: string
comment: Merkmal "Türanschlag" Aus Der Klassifikation "Eclass-6.1".
sub property of: datatypeProductOrServiceProperty

Türöffnung (Eclass-6.1)
type: DatatypeProperty
domain: ProductOrService
range: string
comment: Merkmal "Türöffnung" Aus Der Klassifikation "Eclass-6.1".
sub property of: datatypeProductOrServiceProperty

Trocknungsart (Eclass-6.1)
type: DatatypeProperty
domain: ProductOrService
range: string
comment: Merkmal "Trocknungsart" Aus Der Klassifikation "Eclass-6.1".
sub property of: datatypeProductOrServiceProperty

Trocknungsklasse (Eclass-6.1)
type: DatatypeProperty
domain: ProductOrService
range: string
comment: Merkmal "Trocknungsklasse" Aus Der Klassifikation "Eclass-6.1".
sub property of: datatypeProductOrServiceProperty

Trocknungstemperatur Wählbar (Eclass-6.1)
type: DatatypeProperty
domain: ProductOrService
range: string
comment: Merkmal "Trocknungstemperatur Wählbar" Aus Der Klassifikation "Eclass-6.1".
sub property of: datatypeProductOrServiceProperty

Trommelmaterial (Eclass-6.1)
type: DatatypeProperty
domain: ProductOrService
range: string
comment: Merkmal "Trommelmaterial" Aus Der Klassifikation "Eclass-6.1".
sub property of: datatypeProductOrServiceProperty

Trommelvolumen (Eclass-6.1)
type: ObjectProperty
domain: ProductOrService
range: QuantitativeValueFloat
comment: Merkmal "Trommelvolumen" Aus Der Klassifikation "Eclass-6.1".
sub property of: quantitativeProductOrServiceProperty

Typ Doppeltür (Eclass-6.1)
type: DatatypeProperty
domain: ProductOrService
range: string
comment: Merkmal "Typ Doppeltür" Aus Der Klassifikation "Eclass-6.1".
sub property of: datatypeProductOrServiceProperty

Uhr (Eclass-6.1)
type: DatatypeProperty
domain: ProductOrService
range: string
comment: Merkmal "Uhr" Aus Der Klassifikation "Eclass-6.1".
sub property of: datatypeProductOrServiceProperty

Unwuchtkontrolle (Eclass-6.1)
type: DatatypeProperty
domain: ProductOrService
range: string
comment: Merkmal "Unwuchtkontrolle" Aus Der Klassifikation "Eclass-6.1".
sub property of: datatypeProductOrServiceProperty

Verdecktes Heizelement (Eclass-6.1)
type: DatatypeProperty
domain: ProductOrService
range: string
comment: Merkmal "Verdecktes Heizelement" Aus Der Klassifikation "Eclass-6.1".
sub property of: datatypeProductOrServiceProperty

Verfügbare Farbvarianten (Eclass-6.1)
type: DatatypeProperty
domain: ProductOrService
range: string
comment: Merkmal "Verfügbare Farbvarianten" Aus Der Klassifikation "Eclass-6.1".
sub property of: datatypeProductOrServiceProperty

Verfügbarer Temperaturbereich (Eclass-6.1)
type: ObjectProperty
type: DatatypeProperty
domain: ProductOrService
range: string
range: QuantitativeValueFloat
comment: Merkmal "Verfügbarer Temperaturbereich" Aus Der Klassifikation "Eclass-6.1".
sub property of: datatypeProductOrServiceProperty
sub property of: quantitativeProductOrServiceProperty

Vergleichsprogramm (Eclass-6.1)
type: DatatypeProperty
domain: ProductOrService
range: string
comment: Merkmal "Vergleichsprogramm" Aus Der Klassifikation "Eclass-6.1".
sub property of: datatypeProductOrServiceProperty

Verkaufsbezeichnung (Eclass-6.1)
type: DatatypeProperty
domain: ProductOrService
range: string
comment: Merkmal "Verkaufsbezeichnung" Aus Der Klassifikation "Eclass-6.1".
sub property of: datatypeProductOrServiceProperty

Verpackungsmenge Pro Umkarton (Eclass-6.1)
type: DatatypeProperty
domain: ProductOrService
range: string
comment: Merkmal "Verpackungsmenge Pro Umkarton" Aus Der Klassifikation "Eclass-6.1".
sub property of: datatypeProductOrServiceProperty

Verschmutzungsgraderkennung (Eclass-6.1)
type: DatatypeProperty
domain: ProductOrService
range: string
comment: Merkmal "Verschmutzungsgraderkennung" Aus Der Klassifikation "Eclass-6.1".
sub property of: datatypeProductOrServiceProperty

Verstellbarer Sockel (Eclass-6.1)
type: DatatypeProperty
domain: ProductOrService
range: string
comment: Merkmal "Verstellbarer Sockel" Aus Der Klassifikation "Eclass-6.1".
sub property of: datatypeProductOrServiceProperty

Volumen Wassertank (Eclass-6.1)
type: ObjectProperty
domain: ProductOrService
range: QuantitativeValueFloat
comment: Merkmal "Volumen Wassertank" Aus Der Klassifikation "Eclass-6.1".
sub property of: quantitativeProductOrServiceProperty

Warnsignal Bei Fehlfunktion (Eclass-6.1)
type: DatatypeProperty
domain: ProductOrService
range: string
comment: Merkmal "Warnsignal Bei Fehlfunktion" Aus Der Klassifikation "Eclass-6.1".
sub property of: datatypeProductOrServiceProperty

Waschwirkungsklasse (Eclass-6.1)
type: DatatypeProperty
domain: ProductOrService
range: string
comment: Merkmal "Waschwirkungsklasse" Aus Der Klassifikation "Eclass-6.1".
sub property of: datatypeProductOrServiceProperty

Wasserablaufrohr (Eclass-6.1)
type: DatatypeProperty
domain: ProductOrService
range: string
comment: Merkmal "Wasserablaufrohr" Aus Der Klassifikation "Eclass-6.1".
sub property of: datatypeProductOrServiceProperty

Wasser Plus (Eclass-6.1)
type: DatatypeProperty
domain: ProductOrService
range: string
comment: Merkmal "Wasser Plus" Aus Der Klassifikation "Eclass-6.1".
sub property of: datatypeProductOrServiceProperty

Wassersicherheitssystem (Eclass-6.1)
type: DatatypeProperty
domain: ProductOrService
range: string
comment: Merkmal "Wassersicherheitssystem" Aus Der Klassifikation "Eclass-6.1".
sub property of: datatypeProductOrServiceProperty

Wasserverbrauch (Eclass-6.1)
type: ObjectProperty
domain: ProductOrService
range: QuantitativeValueFloat
comment: Merkmal "Wasserverbrauch" Aus Der Klassifikation "Eclass-6.1".
sub property of: quantitativeProductOrServiceProperty

Wasserverbrauch 30 Grad C Feinwäsche (Eclass-6.1)
type: ObjectProperty
domain: ProductOrService
range: QuantitativeValueFloat
comment: Merkmal "Wasserverbrauch 30 Grad C Feinwäsche" Aus Der Klassifikation "Eclass-6.1".
sub property of: quantitativeProductOrServiceProperty

Wasserverbrauch 30 Grad C Wolle (Eclass-6.1)
type: ObjectProperty
domain: ProductOrService
range: QuantitativeValueFloat
comment: Merkmal "Wasserverbrauch 30 Grad C Wolle" Aus Der Klassifikation "Eclass-6.1".
sub property of: quantitativeProductOrServiceProperty

Wasserverbrauch 40 Grad C Buntwäsche (Eclass-6.1)
type: ObjectProperty
domain: ProductOrService
range: QuantitativeValueFloat
comment: Merkmal "Wasserverbrauch 40 Grad C Buntwäsche" Aus Der Klassifikation "Eclass-6.1".
sub property of: quantitativeProductOrServiceProperty

Wasserverbrauch 40 Grad C Pflegeleicht (Eclass-6.1)
type: ObjectProperty
domain: ProductOrService
range: QuantitativeValueFloat
comment: Merkmal "Wasserverbrauch 40 Grad C Pflegeleicht" Aus Der Klassifikation "Eclass-6.1".
sub property of: quantitativeProductOrServiceProperty

Wasserverbrauch 95 Grad C Baumwolle (Eclass-6.1)
type: ObjectProperty
domain: ProductOrService
range: QuantitativeValueFloat
comment: Merkmal "Wasserverbrauch 95 Grad C Baumwolle" Aus Der Klassifikation "Eclass-6.1".
sub property of: quantitativeProductOrServiceProperty

Wasserzuführung (Eclass-6.1)
type: DatatypeProperty
domain: ProductOrService
range: string
comment: Merkmal "Wasserzuführung" Aus Der Klassifikation "Eclass-6.1".
sub property of: datatypeProductOrServiceProperty

Weitere Funktionen (Eclass-6.1)
type: DatatypeProperty
domain: ProductOrService
range: string
comment: Merkmal "Weitere Funktionen" Aus Der Klassifikation "Eclass-6.1".
sub property of: datatypeProductOrServiceProperty

Werkstoff Innenbehälter (Eclass-6.1)
type: DatatypeProperty
domain: ProductOrService
range: string
comment: Merkmal "Werkstoff Innenbehälter" Aus Der Klassifikation "Eclass-6.1".
sub property of: datatypeProductOrServiceProperty

Zeitschaltuhr (Eclass-6.1)
type: DatatypeProperty
domain: ProductOrService
range: string
comment: Merkmal "Zeitschaltuhr" Aus Der Klassifikation "Eclass-6.1".
sub property of: datatypeProductOrServiceProperty

Zeitsteuerung (Eclass-6.1)
type: DatatypeProperty
domain: ProductOrService
range: string
comment: Merkmal "Zeitsteuerung" Aus Der Klassifikation "Eclass-6.1".
sub property of: datatypeProductOrServiceProperty

Zündfunktion Vorhanden (Eclass-6.1)
type: DatatypeProperty
domain: ProductOrService
range: string
comment: Merkmal "Zündfunktion Vorhanden" Aus Der Klassifikation "Eclass-6.1".
sub property of: datatypeProductOrServiceProperty

Zusätzliche Betriebsart (Grill) (Eclass-6.1)
type: DatatypeProperty
domain: ProductOrService
range: string
comment: Merkmal "Zusätzliche Betriebsart (Grill)" Aus Der Klassifikation "Eclass-6.1".
sub property of: datatypeProductOrServiceProperty

Zusätzliche Betriebsart (Heißluft) (Eclass-6.1)
type: DatatypeProperty
domain: ProductOrService
range: string
comment: Merkmal "Zusätzliche Betriebsart (Heißluft)" Aus Der Klassifikation "Eclass-6.1".
sub property of: datatypeProductOrServiceProperty

Einstellbare Dampfgarprogramme (Eclass-6.1)
type: DatatypeProperty
domain: ProductOrService
range: string
comment: Merkmal "Einstellbare Dampfgarprogramme" Aus Der Klassifikation "Eclass-6.1".
sub property of: datatypeProductOrServiceProperty

Max. Anzahl Espressotassen (Eclass-6.1)
type: DatatypeProperty
domain: ProductOrService
range: string
comment: Merkmal "Max. Anzahl Espressotassen" Aus Der Klassifikation "Eclass-6.1".
sub property of: datatypeProductOrServiceProperty

Max. Anzahl Teller Maßgedeck (Eclass-6.1)
type: DatatypeProperty
domain: ProductOrService
range: string
comment: Merkmal "Max. Anzahl Teller Maßgedeck" Aus Der Klassifikation "Eclass-6.1".
sub property of: datatypeProductOrServiceProperty

Max. Geschirrgröße Oberkorb (Eclass-6.1)
type: ObjectProperty
domain: ProductOrService
range: QuantitativeValueFloat
comment: Merkmal "Max. Geschirrgröße Oberkorb" Aus Der Klassifikation "Eclass-6.1".
sub property of: quantitativeProductOrServiceProperty

Max. Geschirrgröße Unterkorb (Eclass-6.1)
type: ObjectProperty
domain: ProductOrService
range: QuantitativeValueFloat
comment: Merkmal "Max. Geschirrgröße Unterkorb" Aus Der Klassifikation "Eclass-6.1".
sub property of: quantitativeProductOrServiceProperty

Max. Mikrowellenleistung (Eclass-6.1)
type: ObjectProperty
domain: ProductOrService
range: QuantitativeValueFloat
comment: Merkmal "Max. Mikrowellenleistung" Aus Der Klassifikation "Eclass-6.1".
sub property of: quantitativeProductOrServiceProperty

Max. Schleuderdrehzahl (Eclass-6.1)
type: ObjectProperty
domain: ProductOrService
range: QuantitativeValueFloat
comment: Merkmal "Max. Schleuderdrehzahl" Aus Der Klassifikation "Eclass-6.1".
sub property of: quantitativeProductOrServiceProperty

Max. Spannung (Eclass-6.1)
type: ObjectProperty
domain: ProductOrService
range: QuantitativeValueFloat
comment: Merkmal "Max. Spannung" Aus Der Klassifikation "Eclass-6.1".
sub property of: quantitativeProductOrServiceProperty

Max. Startzeitvorwahl (Eclass-6.1)
type: ObjectProperty
domain: ProductOrService
range: QuantitativeValueFloat
comment: Merkmal "Max. Startzeitvorwahl" Aus Der Klassifikation "Eclass-6.1".
sub property of: quantitativeProductOrServiceProperty

Max. Waschtemperatur (Eclass-6.1)
type: ObjectProperty
domain: ProductOrService
range: QuantitativeValueFloat
comment: Merkmal "Max. Waschtemperatur" Aus Der Klassifikation "Eclass-6.1".
sub property of: quantitativeProductOrServiceProperty

Max. Einstellbare Höhe (Eclass-6.1)
type: ObjectProperty
domain: ProductOrService
range: QuantitativeValueFloat
comment: Merkmal "Max. Einstellbare Höhe" Aus Der Klassifikation "Eclass-6.1".
sub property of: quantitativeProductOrServiceProperty

Max. Mögliche Wasserhärte (Eclass-6.1)
type: DatatypeProperty
domain: ProductOrService
range: string
comment: Merkmal "Max. Mögliche Wasserhärte" Aus Der Klassifikation "Eclass-6.1".
sub property of: datatypeProductOrServiceProperty

Mögliche Sprachen (Eclass-6.1)
type: DatatypeProperty
domain: ProductOrService
range: string
comment: Merkmal "Mögliche Sprachen" Aus Der Klassifikation "Eclass-6.1".
sub property of: datatypeProductOrServiceProperty

Min. Frequenz (Eclass-6.1)
type: ObjectProperty
domain: ProductOrService
range: QuantitativeValueFloat
comment: Merkmal "Min. Frequenz" Aus Der Klassifikation "Eclass-6.1".
sub property of: quantitativeProductOrServiceProperty

Min. Spannung (Eclass-6.1)
type: ObjectProperty
domain: ProductOrService
range: QuantitativeValueFloat
comment: Merkmal "Min. Spannung" Aus Der Klassifikation "Eclass-6.1".
sub property of: quantitativeProductOrServiceProperty

Min. Waschtemperatur (Eclass-6.1)
type: ObjectProperty
domain: ProductOrService
range: QuantitativeValueFloat
comment: Merkmal "Min. Waschtemperatur" Aus Der Klassifikation "Eclass-6.1".
sub property of: quantitativeProductOrServiceProperty

Verfügbare Programme (Eclass-6.1)
type: DatatypeProperty
domain: ProductOrService
range: string
comment: Merkmal "Verfügbare Programme" Aus Der Klassifikation "Eclass-6.1".
sub property of: datatypeProductOrServiceProperty

Zusätzliche, Weitere Optionen (Eclass-6.1)
type: DatatypeProperty
domain: ProductOrService
range: string
comment: Merkmal "Zusätzliche, Weitere Optionen" Aus Der Klassifikation "Eclass-6.1".
sub property of: datatypeProductOrServiceProperty